Stories
Slash Boxes
Comments
NOTE: use Perl; is on undef hiatus. You can read content, but you can't post it. More info will be forthcoming forthcomingly.

All the Perl that's Practical to Extract and Report

The Fine Print: The following comments are owned by whoever posted them. We are not responsible for them in any way.
 Full
 Abbreviated
 Hidden
More | Login | Reply
Loading... please wait.
  • Checking if your kit is complete...
    Looks good
    Writing Makefile for Crypt::Rijndael
    cp Rijndael.pm blib/lib/Crypt/Rijndael.pm
    /opt/SUNWspro/bin/cc -c   -I/usr/local/include -D_LARGEFILE_SOURCE -D_FILE_OFFSET_BITS=64 -DPERL_USE_SAFE_PUTENV -DPERL_USE_SAFE_PUTENV -O   -DVERSION=\"1.04\" -DXS_VERSION=\"1.04\" -KPIC "-I/tmp/bleadperl/lib/5.10.0/i86pc-solaris/CORE"   _rijndael.c
    "_rijndael.c", line 425: warning: integer overflow detected: op "<<"
    "_rijndael.c", line 464: warning: integer overflow detected: op "<<"
    /tmp/bleadperl/bin/perl5.10.0 /tmp/bleadperl/lib/5.10.0/ExtUtils/xsubpp  -typemap /tmp/bleadperl/lib/5.10.0/ExtUtils/typemap -typemap typemap  Rijndael.xs > Rijndael.xsc && mv Rijndael.xsc Rijndael.c
    /opt/SUNWspro/bin/cc -c   -I/usr/local/include -D_LARGEFILE_SOURCE -D_FILE_OFFSET_BITS=64 -DPERL_USE_SAFE_PUTENV -DPERL_USE_SAFE_PUTENV -O   -DVERSION=\"1.04\" -DXS_VERSION=\"1.04\" -KPIC "-I/tmp/bleadperl/lib/5.10.0/i86pc-solaris/CORE"   Rijndael.c
    "Rijndael.xs", line 120: warning: argument #3 is incompatible with prototype:
            prototype: pointer to const unsigned char : "rijndael.h", line 112
            argument : pointer to char
    "Rijndael.xs", line 162: warning: argument #4 is incompatible with prototype:
            prototype: pointer to unsigned char : "unknown", line 0
            argument : pointer to char
    Running Mkbootstrap for Crypt::Rijndael ()
    chmod 644 Rijndael.bs
    rm -f blib/arch/auto/Crypt/Rijndael/Rijndael.so
    /opt/SUNWspro/bin/cc  -G -L/usr/lib -L/usr/ccs/lib -L/opt/SUNWspro/prod/lib -L/lib -L/usr/local/lib _rijndael.o Rijndael.o  -o blib/arch/auto/Crypt/Rijndael/Rijndael.so        \
            \

    chmod 755 blib/arch/auto/Crypt/Rijndael/Rijndael.so
    cp Rijndael.bs blib/arch/auto/Crypt/Rijndael/Rijndael.bs
    chmod 644 blib/arch/auto/Crypt/Rijndael/Rijndael.bs
    Manifying blib/man3/Crypt::Rijndael.3
      BDFOY/Crypt-Rijndael-1.04.tar.gz
      /usr/bin/make -- OK
    Running make test
    /tmp/bleadperl/bin/perl5.10.0 "-MTest::Manifest" "-e" "run_t_manifest(0, 'blib/lib', 'blib/arch',  )"
    Level is
    Test::Manifest::test_harness found [t/00_load.t t/pod.t t/pod_coverage.t]
    t/00_load.........FAILED tests 36, 38, 40
            Failed 3/41 tests, 92.68% okay
    t/pod.............ok
    t/pod_coverage....ok
    Failed Test Stat Wstat Total Fail  List of Failed
    ------------------------------------------------------------------------ -------
    t/00_load.t               41    3  36 38 40
    Failed 1/3 test scripts. 3/43 subtests failed.
    Files=3, Tests=43,  1 wallclock secs ( 0.38 cusr +  0.12 csys =  0.50 CPU)
    Failed 1/3 test programs. 3/43 subtests failed.
    make: *** [test_dynamic] Error 255
    ...and with prove....

    [steve@sulu Crypt-Rijndael-1.04-HYXoPF]$ /tmp/bleadperl/bin/prove5.10.0 -bv t/00_load.t
    t/00_load....1..41
    ok 1
    ok 2
    ok 3
    ok 4
    ok 5
    ok 6
    ok 7
    ok 8
    ok 9
    ok 10
    ok 11
    ok 12
    ok 13
    ok 14
    ok 15
    ok 16
    ok 17
    ok 18
    ok 19
    ok 20
    ok 21
    ok 22
    ok 23
    ok 24
    ok 25
    ok 26
    ok 27
    ok 28
    ok 29
    ok 30
    ok 31
    ok 32
    ok 33
    ok 34
    ok 35
    not ok 36
    ok 37
    not ok 38
    ok 39
    not ok 40
    ok 41
    FAILED tests 36, 38, 40
            Failed 3/41 tests, 92.68% okay
    Failed Test Stat Wstat Total Fail  List of Failed
    ------------------------------------------------------------------------ -------
    t/00_load.t               41    3  36 38 40
    Failed 1/1 test scripts. 3/41 subtests failed.
    Files=1, Tests=41,  0 wallclock secs ( 0.03 cusr +  0.01 csys =  0.04 CPU)
    Failed 1/1 test programs. 3/41 subtests failed.
    ...using...

    [steve@sulu Crypt-Rijndael-1.04-HYXoPF]$ uname -a
    SunOS sulu 5.11 snv_40 i86pc i386 i86pc
    [steve@sulu Crypt-Rijndael-1.04-HYXoPF]$ cc -V
    cc: Sun C 5.8 2005/10/13
    • I forgot to mention that I need this for the latest developer version (Crypt-Rijndael-1.04_02). That's where the extra tests are :)