Slash Boxes
NOTE: use Perl; is on undef hiatus. You can read content, but you can't post it. More info will be forthcoming forthcomingly.

All the Perl that's Practical to Extract and Report

The Fine Print: The following comments are owned by whoever posted them. We are not responsible for them in any way.
More | Login | Reply
Loading... please wait.
  • the tests fail on my install of solaris because -h isnt a valid option for dtrace. in a spooky coincidence my cpan testing had just got to it when i was reading the post.
    • Ah, thanks. More seriously it's getting a bus error on non-trivial programs. Needs work I think :)
      • Its failing on Leopard too, but I am getting: cc -c -Wall -O3 -DVERSION=\"0.03\" -DXS_VERSION=\"0.03\" "-I/System/Library/Perl/5.8.8/darwin-thread-multi-2level/CORE" runops.c runops.c: In function '_curcv': runops.c:10: error: 'dVAR' undeclared (first use in this function) runops.c:10: error: (Each undeclared identifier is reported only once runops.c:10: error: for each function it appears in.) make: *** [runops.o] Error 1 ANDYA/Devel-DTrace-0.03.tar.gz /usr/bin/make -- NOT OK Running make test C