Stories
Slash Boxes
Comments
NOTE: use Perl; is on undef hiatus. You can read content, but you can't post it. More info will be forthcoming forthcomingly.

All the Perl that's Practical to Extract and Report

use Perl Log In

Log In

[ Create a new account ]

jonasbn (1153)

jonasbn
  reversethis-{gro.napc} {ta} {nbsanoj}
http://e-diot.dk/
AOL IM: BJonasN (Add Buddy, Send Message)

Perl Programmer located in Copenhagen, Denmark. Active member of Copenhagen Perl Mongers.

Author of:

  • Business::DK::CPR
  • Business::DK::CVR
  • Business::DK::PO
  • Business::OnlinePayment::CashCow
  • Date::Holidays
  • Date::Holidays::Abstract
  • Date::Holidays::Super
  • Date::Pregnancy
  • Games::Bingo
  • Games::Bingo::Bot
  • Games::Bingo::Print
  • Module::Info::File
  • Module::Template::Setup
  • Test::Timer

and maintainer of:

  • Tie::Tools
  • XML::Conf
  • Workflow

Journal of jonasbn (1153)

Monday January 27, 2003
03:39 PM

Smoking

[ #10217 ]

I mailed my first smoke test report today to the daily-build list. I think I can do better, I need to install some libs and get some library paths set correctly.

This is the report, I think I can see a few patterns :)

Automated smoke report for patch 18586 on darwin - 1.4
                    v1.10 using cc version Apple devkit-based CPP 6.0
O = OK
F = Failure(s), extended report at the bottom
? = still running or test results not (yet) available
Build failures during: - = unknown
        c = Configure, m = make, t = make test-prep

                  Configuration
------- --------------------------------------------------------------------
F F F F
F F F F -Uuseperlio
F F F F -Duseperlio
F F F F -Duseperlio -Duse64bitint
F F F F -Duseperlio -Duse64bitall
F F F F -Duseperlio -Duselongdouble
F F F F -Duseperlio -Dusemorebits
F F F F -Duseperlio -Duse64bitall -Duselongdouble
F F F F -Dusethreads -Duseithreads
c c c c -Dusethreads -Duseithreads -Uuseperlio
F F F F -Dusethreads -Duseithreads -Duseperlio
F F F F -Dusethreads -Duseithreads -Duseperlio -Duse64bitint
F F F F -Dusethreads -Duseithreads -Duseperlio -Duse64bitall
F F F F -Dusethreads -Duseithreads -Duseperlio -Duselongdouble
F F F F -Dusethreads -Duseithreads -Duseperlio -Dusemorebits
F F F F -Dusethreads -Duseithreads -Duseperlio -Duse64bitall -Duselongdouble
| | | +- PERLIO = perlio -DDEBUGGING
| | +--- PERLIO = stdio -DDEBUGGING
| +----- PERLIO = perlio
+------- PERLIO = stdio

Failures:

darwin stdio/perlio
darwin stdio/perlio -DDEBUGGING
        t/op/mkdir...........................FAILED at test 12
        ext/DB_File/t/db-btree...............FAILED at test 0
        ext/DB_File/t/db-recno...............FAILED at test 64
        lib/Net/t/hostname...................FAILED at test 1

darwin stdio/perlio -Uuseperlio
darwin stdio/perlio -DDEBUGGING -Uuseperlio
        t/op/mkdir...........................FAILED at test 12
        ext/DB_File/t/db-btree...............FAILED at test 0
        ext/DB_File/t/db-recno...............FAILED at test 64
        ext/Devel/Peek/Peek..................FAILED at test 13
        lib/Net/t/hostname...................FAILED at test 1

darwin stdio/perlio -Duseperlio
darwin stdio/perlio -DDEBUGGING -Duseperlio
darwin stdio/perlio -Duseperlio -Duse64bitint
darwin stdio/perlio -DDEBUGGING -Duseperlio -Duse64bitint
darwin stdio/perlio -Duseperlio -Duse64bitall
darwin stdio/perlio -DDEBUGGING -Duseperlio -Duse64bitall
darwin stdio/perlio -Duseperlio -Duselongdouble
darwin stdio/perlio -DDEBUGGING -Duseperlio -Duselongdouble
darwin stdio/perlio -Duseperlio -Dusemorebits
darwin stdio/perlio -DDEBUGGING -Duseperlio -Dusemorebits
darwin stdio/perlio -Duseperlio -Duse64bitall -Duselongdouble
darwin stdio/perlio -DDEBUGGING -Duseperlio -Duse64bitall -Duselongdouble
        t/op/mkdir...........................FAILED at test 12
        ext/DB_File/t/db-btree...............FAILED at test 0
        ext/DB_File/t/db-recno...............FAILED at test 64
        lib/Net/t/hostname...................FAILED at test 1

darwin stdio -Dusethreads -Duseithreads
        t/op/mkdir...........................FAILED at test 12
        ext/DB_File/t/db-btree...............FAILED at test 0
        ext/DB_File/t/db-recno...............FAILED at test 64
        ext/threads/t/libc...................FAILED at test 1
        lib/Net/t/hostname...................FAILED at test 1

darwin perlio -Dusethreads -Duseithreads
        t/op/mkdir...........................FAILED at test 12
        ext/DB_File/t/db-btree...............FAILED at test 0
        ext/DB_File/t/db-recno...............FAILED at test 64
        ext/threads/t/libc...................FAILED at test 7
        lib/Net/t/hostname...................FAILED at test 1

darwin stdio -DDEBUGGING -Dusethreads -Duseithreads
        t/op/mkdir...........................FAILED at test 12
        ext/DB_File/t/db-btree...............FAILED at test 0
        ext/DB_File/t/db-recno...............FAILED at test 64
        ext/threads/t/libc...................FAILED at test 11
        lib/Net/t/hostname...................FAILED at test 1

darwin perlio -DDEBUGGING -Dusethreads -Duseithreads
        t/op/mkdir...........................FAILED at test 12
        ext/DB_File/t/db-btree...............FAILED at test 0
        ext/DB_File/t/db-recno...............FAILED at test 64
        ext/threads/t/libc...................FAILED at test 4
        lib/Net/t/hostname...................FAILED at test 1

darwin stdio -Dusethreads -Duseithreads -Duseperlio
        t/op/mkdir...........................FAILED at test 12
        ext/DB_File/t/db-btree...............FAILED at test 0
        ext/DB_File/t/db-recno...............FAILED at test 64
        ext/threads/t/libc...................FAILED at test 5
        lib/Net/t/hostname...................FAILED at test 1

darwin perlio -Dusethreads -Duseithreads -Duseperlio
        t/op/mkdir...........................FAILED at test 12
        ext/DB_File/t/db-btree...............FAILED at test 0
        ext/DB_File/t/db-recno...............FAILED at test 64
        ext/threads/t/libc...................FAILED at test 2
        lib/Net/t/hostname...................FAILED at test 1

darwin stdio -DDEBUGGING -Dusethreads -Duseithreads -Duseperlio
        t/op/mkdir...........................FAILED at test 12
        ext/DB_File/t/db-btree...............FAILED at test 0
        ext/DB_File/t/db-recno...............FAILED at test 64
        ext/threads/t/libc...................FAILED at test 1
        lib/Net/t/hostname...................FAILED at test 1

darwin perlio -DDEBUGGING -Dusethreads -Duseithreads -Duseperlio
        t/op/mkdir...........................FAILED at test 12
        ext/DB_File/t/db-btree...............FAILED at test 0
        ext/DB_File/t/db-recno...............FAILED at test 64
        ext/threads/t/libc...................FAILED at test 2
        lib/Net/t/hostname...................FAILED at test 1

darwin stdio -Dusethreads -Duseithreads -Duseperlio -Duse64bitint
        t/op/mkdir...........................FAILED at test 12
        ext/DB_File/t/db-btree...............FAILED at test 0
        ext/DB_File/t/db-recno...............FAILED at test 64
        ext/threads/t/libc...................FAILED at test 3
        lib/Net/t/hostname...................FAILED at test 1

darwin perlio -Dusethreads -Duseithreads -Duseperlio -Duse64bitint
        t/op/mkdir...........................FAILED at test 12
        ext/DB_File/t/db-recno...............FAILED at test 64
        lib/Net/t/hostname...................FAILED at test 1

darwin stdio -DDEBUGGING -Dusethreads -Duseithreads -Duseperlio -Duse64bitint
        t/op/mkdir...........................FAILED at test 12
        ext/DB_File/t/db-recno...............FAILED at test 64
        ext/threads/t/libc...................FAILED at test 2
        lib/Net/t/hostname...................FAILED at test 1

darwin perlio -DDEBUGGING -Dusethreads -Duseithreads -Duseperlio -Duse64bitint
        t/op/mkdir...........................FAILED at test 12
        ext/DB_File/t/db-recno...............FAILED at test 64
        ext/threads/t/libc...................FAILED at test 1
        lib/Net/t/hostname...................FAILED at test 1

darwin stdio -Dusethreads -Duseithreads -Duseperlio -Duse64bitall
        t/op/mkdir...........................FAILED at test 12
        ext/DB_File/t/db-btree...............FAILED at test 0
        ext/DB_File/t/db-recno...............FAILED at test 64
        ext/threads/t/libc...................FAILED at test 9
        lib/Net/t/hostname...................FAILED at test 1

darwin perlio -Dusethreads -Duseithreads -Duseperlio -Duse64bitall
        t/op/mkdir...........................FAILED at test 12
        ext/DB_File/t/db-recno...............FAILED at test 64
        ext/threads/t/libc...................FAILED at test 5
        lib/Net/t/hostname...................FAILED at test 1

darwin stdio -DDEBUGGING -Dusethreads -Duseithreads -Duseperlio -Duse64bitall
        t/op/mkdir...........................FAILED at test 12
        ext/DB_File/t/db-recno...............FAILED at test 64
        ext/threads/t/libc...................FAILED at test 4
        lib/Net/t/hostname...................FAILED at test 1

darwin perlio -DDEBUGGING -Dusethreads -Duseithreads -Duseperlio -Duse64bitall
        t/op/mkdir...........................FAILED at test 12
        ext/DB_File/t/db-recno...............FAILED at test 64
        ext/threads/t/libc...................FAILED at test 2
        lib/Net/t/hostname...................FAILED at test 1

darwin stdio -Dusethreads -Duseithreads -Duseperlio -Duselongdouble
        t/op/mkdir...........................FAILED at test 12
        ext/DB_File/t/db-btree...............FAILED at test 0
        ext/DB_File/t/db-recno...............FAILED at test 64
        ext/threads/t/libc...................FAILED at test 6
        lib/Net/t/hostname...................FAILED at test 1

darwin perlio -Dusethreads -Duseithreads -Duseperlio -Duselongdouble
        t/op/mkdir...........................FAILED at test 12
        ext/DB_File/t/db-btree...............FAILED at test 0
        ext/DB_File/t/db-recno...............FAILED at test 64
        ext/threads/t/libc...................FAILED at test 8
        lib/Net/t/hostname...................FAILED at test 1

darwin stdio -DDEBUGGING -Dusethreads -Duseithreads -Duseperlio -Duselongdouble
        t/op/mkdir...........................FAILED at test 12
        ext/DB_File/t/db-btree...............FAILED at test 0
        ext/DB_File/t/db-recno...............FAILED at test 64
        ext/threads/t/libc...................FAILED at test 5
        lib/Net/t/hostname...................FAILED at test 1

darwin perlio -DDEBUGGING -Dusethreads -Duseithreads -Duseperlio -Duselongdouble
        t/op/mkdir...........................FAILED at test 12
        ext/DB_File/t/db-btree...............FAILED at test 0
        ext/DB_File/t/db-recno...............FAILED at test 64
        ext/threads/t/libc...................FAILED at test 4
        lib/Net/t/hostname...................FAILED at test 1

darwin stdio -Dusethreads -Duseithreads -Duseperlio -Dusemorebits
        t/op/mkdir...........................FAILED at test 12
        ext/DB_File/t/db-btree...............FAILED at test 0
        ext/DB_File/t/db-recno...............FAILED at test 64
        ext/threads/t/libc...................FAILED at test 4
        lib/Net/t/hostname...................FAILED at test 1

darwin perlio -Dusethreads -Duseithreads -Duseperlio -Dusemorebits
        t/op/mkdir...........................FAILED at test 12
        ext/DB_File/t/db-recno...............FAILED at test 64
        ext/threads/t/libc...................FAILED at test 5
        lib/Net/t/hostname...................FAILED at test 1

darwin stdio -DDEBUGGING -Dusethreads -Duseithreads -Duseperlio -Dusemorebits
        t/op/mkdir...........................FAILED at test 12
        ext/DB_File/t/db-recno...............FAILED at test 64
        ext/threads/t/libc...................FAILED at test 2
        lib/Net/t/hostname...................FAILED at test 1

darwin perlio -DDEBUGGING -Dusethreads -Duseithreads -Duseperlio -Dusemorebits
        t/op/mkdir...........................FAILED at test 12
        ext/DB_File/t/db-recno...............FAILED at test 64
        ext/threads/t/libc...................FAILED at test 4
        lib/Net/t/hostname...................FAILED at test 1

darwin stdio -Dusethreads -Duseithreads -Duseperlio -Duse64bitall -Duselongdouble
        t/op/mkdir...........................FAILED at test 12
        ext/DB_File/t/db-btree...............FAILED at test 0
        ext/DB_File/t/db-recno...............FAILED at test 64
        ext/threads/t/libc...................FAILED at test 4
        lib/Net/t/hostname...................FAILED at test 1

darwin perlio -Dusethreads -Duseithreads -Duseperlio -Duse64bitall -Duselongdouble
        t/op/mkdir...........................FAILED at test 12
        ext/DB_File/t/db-recno...............FAILED at test 64
        ext/threads/t/libc...................FAILED at test 5
        lib/Net/t/hostname...................FAILED at test 1

darwin stdio -DDEBUGGING -Dusethreads -Duseithreads -Duseperlio -Duse64bitall -Duselongdouble
        t/op/mkdir...........................FAILED at test 12
        ext/DB_File/t/db-recno...............FAILED at test 64
        ext/threads/t/libc...................FAILED at test 2
        lib/Net/t/hostname...................FAILED at test 1

darwin perlio -DDEBUGGING -Dusethreads -Duseithreads -Duseperlio -Duse64bitall -Duselongdouble
        t/op/mkdir...........................FAILED at test 12
        ext/DB_File/t/db-recno...............FAILED at test 64
        ext/threads/t/libc...................FAILED at test 10
        lib/Net/t/hostname...................FAILED at test 1

The Fine Print: The following comments are owned by whoever posted them. We are not responsible for them in any way.
 Full
 Abbreviated
 Hidden
More | Login | Reply
Loading... please wait.